{"text_format":"1","workbook":"xlsx","n_sheets":6,"sheets":["FY 2024 TABLE 15","Fiscal Year 2024 Worksheet","Fiscal Year 2025 Worksheet","Fiscal Year 2026 Worksheet","Division Source","Source Data"],"not_rendered":{"charts":0,"images":0,"macros":1,"external_links":0,"defined_names":25,"comments":4,"pivot_tables":0},"unopened":[],"bounds":{"document_bytes":16777216,"sheet_cells":100000,"rows_first":2000,"rows_last":500,"rows_between":2000,"halvings":0,"cell_chars":16384,"cell_head_chars":4096},"cells_cut":0,"cells_raw":0,"read":"whole","date_system":"1900"}

{"sheet":"FY 2024 TABLE 15","index":0,"n_rows":156,"n_cols":13,"rows_kept":156,"cut":false,"hidden":false,"merged":[[6,11,6,12],[5,7,5,8],[6,9,6,10],[4,7,4,8],[6,3,6,4],[6,5,6,6],[6,7,6,8],[147,0,147,12],[152,0,152,12],[153,0,153,12],[154,0,154,12],[148,0,148,12],[149,0,149,12],[150,0,150,12],[151,0,151,12]]}
["Table 15 of the Superintendent's Annual Report for Virginia "]
["Sources of Financial Support for Expenditures, Total Expenditures for Operations 1, 8 and Total Per Pupil Expenditures for Operations"]
["Fiscal Year 2024"]
[]
[null,null,"End-of-Year"]
[null,null,"ADM for",null,null,null,null,"State Retail Sales"]
[null,null,"Determining","Local 3",null,"State",null,"And Use Tax 4",null,"Federal",null,"Total"]
[null,null,"Cost Per",null,"Per",null,"Per",null,"Per",null,"Per","Expenditures for","Per Pupil"]
[{"$f":"'Fiscal Year 2024 Worksheet'!A5","v":0},"School Division","Pupil 2","Amount","Pupil","Amount","Pupil","Amount","Pupil","Amount","Pupil","Operations 3","Expenditure 5"]
[null,"COUNTIES"]
[1,"Accomack",4757.3500000000004,20301910.309999995,4267,38445925.799999997,8081,6009078.5999999996,1263,12990612.310000001,2731,77747527.019999996,16343]
[2,"Albemarle",13840.910000000002,205556956.06999999,14851,54836933.580000006,3962,21141568.359999999,1527,14309384.270000001,1034,295844842.27999997,21375]
[3,"Alleghany Highlands",2793.8900000000003,12426177.339999996,4448,25567108.690000001,9151,3778505,1352,5554571.4300000006,1988,47326362.460000001,16939]
[4,"Amelia",1585.71,6860297.8299999945,4326,12233875.900000002,7715,2487402.84,1569,2772775.2600000007,1749,24354351.829999998,15359]
[5,"Amherst",3923.25,16466172.450000003,4197,33423151.539999999,8519,5881097.4199999999,1499,6860015.04,1749,62630436.450000003,15964]
{"$rows_left_out":142}
{"sheet":"Fiscal Year 2024 Worksheet","index":1,"n_rows":137,"n_cols":44,"rows_kept":137,"cut":false,"hidden":false,"merged":[[42,0,42,2],[65,0,65,7],[66,0,66,7],[67,0,67,7],[68,0,68,7],[0,0,0,7],[1,0,1,7],[19,0,19,2],[38,0,38,3],[7,0,7,2],[8,0,8,3]]}
["SUPERINTENDENT'S ANNUAL REPORT FOR VIRGINIA",null,null,null,null,null,null,null,null,null,null,null,null,null,null,null,null,null,null,null,null,null,null,null,null,null,"DIV NUM","DIVISION","State Expenditures","State PPA","Federal Expenditures","Federal PPA","Local Expenditures","Local PPA","Total Expenditures","Total PPA","Check T-15 State","Check T-15 PPA State","Check T-15 Federal","Check T-15 PPA Federal","Check T-15 Local","Check T-15 PPA Local","Check T-15 Total","Check T-15 PPA Total"]
["TABLE 15 METHODOLOGY - FISCAL YEAR 2024\nNote: As of FY 2012, Table 15 contains Pre-kindergarten (Program 8) expenditures and average daily membership (ADM).",null,null,null,null,null,null,null,null,null,null,null,null,null,null,null,null,null,null,null,null,null,null,null,null,null,1,"Accomack",30493566.340000004,5846,6481413.6000000006,1243,16844674.519999996,3229,58778173.780000001,11269,{"$f":"VLOOKUP(AA2,'FY 2024 TABLE 15'!$A$11:$M$146,6,FALSE)-AC2","v":7952359.4599999934},{"$f":"VLOOKUP(AA2,'FY 2024 TABLE 15'!$A$11:$M$146,7,FALSE)-AD2","v":2235},{"$f":"VLOOKUP(AA2,'FY 2024 TABLE 15'!$A$11:$M$146,10,FALSE)-AE2","v":6509198.71},{"$f":"VLOOKUP(AA2,'FY 2024 TABLE 15'!$A$11:$M$146,11,FALSE)-AF2","v":1488},{"$f":"VLOOKUP(AA2,'FY 2024 TABLE 15'!$A$11:$M$146,4,FALSE)-AG2","v":3457235.7899999991},{"$f":"VLOOKUP(AA2,'FY 2024 TABLE 15'!$A$11:$M$146,5,FALSE)-AH2","v":1038},{"$f":"VLOOKUP(AA2,'FY 2024 TABLE 15'!$A$11:$M$146,12,FALSE)-AI2","v":18969353.239999995},{"$f":"VLOOKUP(AA2,'FY 2024 TABLE 15'!$A$11:$M$146,13,FALSE)-AJ2","v":5074}]
[null,null,null,null,null,null,null,null,null,null,null,null,null,null,null,null,null,null,null,null,null,null,null,null,null,null,2,"Albemarle",32557294.419999987,2359,10142757.870000003,735,128405694.37,9304,187260598.41999999,13568,{"$f":"VLOOKUP(AA3,'FY 2024 TABLE 15'!$A$11:$M$146,6,FALSE)-AC3","v":22279639.160000019},{"$f":"VLOOKUP(AA3,'FY 2024 TABLE 15'!$A$11:$M$146,7,FALSE)-AD3","v":1603},{"$f":"VLOOKUP(AA3,'FY 2024 TABLE 15'!$A$11:$M$146,10,FALSE)-AE3","v":4166626.3999999985},{"$f":"VLOOKUP(AA3,'FY 2024 TABLE 15'!$A$11:$M$146,11,FALSE)-AF3","v":299},{"$f":"VLOOKUP(AA3,'FY 2024 TABLE 15'!$A$11:$M$146,4,FALSE)-AG3","v":77151261.699999988},{"$f":"VLOOKUP(AA3,'FY 2024 TABLE 15'!$A$11:$M$146,5,FALSE)-AH3","v":5547},{"$f":"VLOOKUP(AA3,'FY 2024 TABLE 15'!$A$11:$M$146,12,FALSE)-AI3","v":108584243.85999998},{"$f":"VLOOKUP(AA3,'FY 2024 TABLE 15'!$A$11:$M$146,13,FALSE)-AJ3","v":7807}]
["Div Num","Division",null,null,null,null,null,null,null,null,null,null,null,null,null,null,null,null,null,null,null,null,null,null,null,null,3,"Alleghany",12484391.713321866,5708,1891264.0400000003,865,9492795.8300000001,4340,26245122.363321867,11999,{"$f":"VLOOKUP(AA4,'FY 2024 TABLE 15'!$A$11:$M$146,6,FALSE)-AC4","v":13082716.976678135},{"$f":"VLOOKUP(AA4,'FY 2024 TABLE 15'!$A$11:$M$146,7,FALSE)-AD4","v":3443},{"$f":"VLOOKUP(AA4,'FY 2024 TABLE 15'!$A$11:$M$146,10,FALSE)-AE4","v":3663307.3900000006},{"$f":"VLOOKUP(AA4,'FY 2024 TABLE 15'!$A$11:$M$146,11,FALSE)-AF4","v":1123},{"$f":"VLOOKUP(AA4,'FY 2024 TABLE 15'!$A$11:$M$146,4,FALSE)-AG4","v":2933381.5099999961},{"$f":"VLOOKUP(AA4,'FY 2024 TABLE 15'!$A$11:$M$146,5,FALSE)-AH4","v":108},{"$f":"VLOOKUP(AA4,'FY 2024 TABLE 15'!$A$11:$M$146,12,FALSE)-AI4","v":21081240.096678134},{"$f":"VLOOKUP(AA4,'FY 2024 TABLE 15'!$A$11:$M$146,13,FALSE)-AJ4","v":4940}]
[0,"<SELECT DIVISION>",null,null,null,null,null,null,null,null,null,null,null,null,null,null,null,null,null,null,null,null,null,null,null,null,4,"Amelia",8885775.8490424883,4970,1355456.45,758,5774534.5800000047,3230,18049479.299042493,10095,{"$f":"VLOOKUP(AA5,'FY 2024 TABLE 15'!$A$11:$M$146,6,FALSE)-AC5","v":3348100.050957514},{"$f":"VLOOKUP(AA5,'FY 2024 TABLE 15'!$A$11:$M$146,7,FALSE)-AD5","v":2745},{"$f":"VLOOKUP(AA5,'FY 2024 TABLE 15'!$A$11:$M$146,10,FALSE)-AE5","v":1417318.8100000008},{"$f":"VLOOKUP(AA5,'FY 2024 TABLE 15'!$A$11:$M$146,11,FALSE)-AF5","v":991},{"$f":"VLOOKUP(AA5,'FY 2024 TABLE 15'!$A$11:$M$146,4,FALSE)-AG5","v":1085763.2499999898},{"$f":"VLOOKUP(AA5,'FY 2024 TABLE 15'!$A$11:$M$146,5,FALSE)-AH5","v":1096},{"$f":"VLOOKUP(AA5,'FY 2024 TABLE 15'!$A$11:$M$146,12,FALSE)-AI5","v":6304872.5309575051},{"$f":"VLOOKUP(AA5,'FY 2024 TABLE 15'!$A$11:$M$146,13,FALSE)-AJ5","v":5264}]
[null,null,null,null,null,null,null,null,null,null,null,null,null,null,null,null,null,null,null,null,null,null,null,null,null,null,5,"Amherst",21622212.06398882,5263,3988762.9500000007,971,15556122.090000005,3786,46087120.703988828,11217,{"$f":"VLOOKUP(AA6,'FY 2024 TABLE 15'!$A$11:$M$146,6,FALSE)-AC6","v":11800939.476011179},{"$f":"VLOOKUP(AA6,'FY 2024 TABLE 15'!$A$11:$M$146,7,FALSE)-AD6","v":3256},{"$f":"VLOOKUP(AA6,'FY 2024 TABLE 15'!$A$11:$M$146,10,FALSE)-AE6","v":2871252.0899999994},{"$f":"VLOOKUP(AA6,'FY 2024 TABLE 15'!$A$11:$M$146,11,FALSE)-AF6","v":778},{"$f":"VLOOKUP(AA6,'FY 2024 TABLE 15'!$A$11:$M$146,4,FALSE)-AG6","v":910050.35999999754},{"$f":"VLOOKUP(AA6,'FY 2024 TABLE 15'!$A$11:$M$146,5,FALSE)-AH6","v":411},{"$f":"VLOOKUP(AA6,'FY 2024 TABLE 15'!$A$11:$M$146,12,FALSE)-AI6","v":16543315.746011175},{"$f":"VLOOKUP(AA6,'FY 2024 TABLE 15'!$A$11:$M$146,13,FALSE)-AJ6","v":4747}]
[null,null,null,null,null,null,null,null,null,null,null,null,null,null,null,null,null,null,null,null,null,null,null,null,null,null,6,"Appomattox",11833119.795646213,5151,1911552.79,832,6032373.0199999986,2626,22253401.965646211,9687,{"$f":"VLOOKUP(AA7,'FY 2024 TABLE 15'!$A$11:$M$146,6,FALSE)-AC7","v":3578697.1443537846},{"$f":"VLOOKUP(AA7,'FY 2024 TABLE 15'!$A$11:$M$146,7,FALSE)-AD7","v":1423},{"$f":"VLOOKUP(AA7,'FY 2024 TABLE 15'!$A$11:$M$146,10,FALSE)-AE7","v":1566300.5499999998},{"$f":"VLOOKUP(AA7,'FY 2024 TABLE 15'!$A$11:$M$146,11,FALSE)-AF7","v":652},{"$f":"VLOOKUP(AA7,'FY 2024 TABLE 15'!$A$11:$M$146,4,FALSE)-AG7","v":4116423.490000003},{"$f":"VLOOKUP(AA7,'FY 2024 TABLE 15'!$A$11:$M$146,5,FALSE)-AH7","v":1703},{"$f":"VLOOKUP(AA7,'FY 2024 TABLE 15'!$A$11:$M$146,12,FALSE)-AI7","v":9992242.584353786},{"$f":"VLOOKUP(AA7,'FY 2024 TABLE 15'!$A$11:$M$146,13,FALSE)-AJ7","v":4069}]
["1a.  Expenditures for operations:  (see cell comment)",null,null,null,null,{"$f":"SUM(VLOOKUP($A$5,'Source Data'!A2:P137,16,FALSE)+VLOOKUP($A$5,'Source Data'!A2:P137,15,FALSE))-F14-F16","v":{"$error":"#N/A"}},null,null,null,null,null,null,null,null,null,null,null,null,null,null,null,null,null,null,null,null,7,"Arlington",42845280.418288283,1627,15319516.500000002,582,438473479.92000002,16651,521312686.89828831,19797,{"$f":"VLOOKUP(AA8,'FY 2024 TABLE 15'!$A$11:$M$146,6,FALSE)-AC8","v":26668670.711711712},{"$f":"VLOOKUP(AA8,'FY 2024 TABLE 15'!$A$11:$M$146,7,FALSE)-AD8","v":868},{"$f":"VLOOKUP(AA8,'FY 2024 TABLE 15'!$A$11:$M$146,10,FALSE)-AE8","v":8879392.3100000005},{"$f":"VLOOKUP(AA8,'FY 2024 TABLE 15'!$A$11:$M$146,11,FALSE)-AF8","v":287},{"$f":"VLOOKUP(AA8,'FY 2024 TABLE 15'!$A$11:$M$146,4,FALSE)-AG8","v":161686445.48000008},{"$f":"VLOOKUP(AA8,'FY 2024 TABLE 15'!$A$11:$M$146,5,FALSE)-AH8","v":4894},{"$f":"VLOOKUP(AA8,'FY 2024 TABLE 15'!$A$11:$M$146,12,FALSE)-AI8","v":209110380.07171172},{"$f":"VLOOKUP(AA8,'FY 2024 TABLE 15'!$A$11:$M$146,13,FALSE)-AJ8","v":6424}]
["(Click here for Chart of Accounts)",null,null,null,null,null,null,null,null,null,null,null,null,null,null,null,null,null,null,null,null,null,null,null,null,null,8,"Augusta",44544375.29312899,4324,10152353.970000001,986,42920014.539999992,4167,109159008.54312898,10597,{"$f":"VLOOKUP(AA9,'FY 2024 TABLE 15'!$A$11:$M$146,6,FALSE)-AC9","v":23673359.616871007},{"$f":"VLOOKUP(AA9,'FY 2024 TABLE 15'!$A$11:$M$146,7,FALSE)-AD9","v":2465},{"$f":"VLOOKUP(AA9,'FY 2024 TABLE 15'!$A$11:$M$146,10,FALSE)-AE9","v":3564373.34},{"$f":"VLOOKUP(AA9,'FY 2024 TABLE 15'!$A$11:$M$146,11,FALSE)-AF9","v":379},{"$f":"VLOOKUP(AA9,'FY 2024 TABLE 15'!$A$11:$M$146,4,FALSE)-AG9","v":7842144.1100000292},{"$f":"VLOOKUP(AA9,'FY 2024 TABLE 15'!$A$11:$M$146,5,FALSE)-AH9","v":885},{"$f":"VLOOKUP(AA9,'FY 2024 TABLE 15'!$A$11:$M$146,12,FALSE)-AI9","v":38124322.246871039},{"$f":"VLOOKUP(AA9,'FY 2024 TABLE 15'!$A$11:$M$146,13,FALSE)-AJ9","v":4060}]
["1b.  Less tuition from another county or city (revenue 1901010 and 1901020): ",null,null,null,null,{"$f":"VLOOKUP($A$5,'Source Data'!A2:P137,15, FALSE)","v":{"$error":"#N/A"}},null,null,null,null,null,null,null,null,null,null,null,null,null,null,null,null,null,null,null,null,9,"Bath",1186959.3492770419,2142,750005.6,1353,8474265.6499999985,15292,11011559.819277041,19871,{"$f":"VLOOKUP(AA10,'FY 2024 TABLE 15'!$A$11:$M$146,6,FALSE)-AC10","v":511408.43072295818},{"$f":"VLOOKUP(AA10,'FY 2024 TABLE 15'!$A$11:$M$146,7,FALSE)-AD10","v":1197},{"$f":"VLOOKUP(AA10,'FY 2024 TABLE 15'!$A$11:$M$146,10,FALSE)-AE10","v":340336.52000000014},{"$f":"VLOOKUP(AA10,'FY 2024 TABLE 15'!$A$11:$M$146,11,FALSE)-AF10","v":790},{"$f":"VLOOKUP(AA10,'FY 2024 TABLE 15'!$A$11:$M$146,4,FALSE)-AG10","v":531336.90000000224},{"$f":"VLOOKUP(AA10,'FY 2024 TABLE 15'!$A$11:$M$146,5,FALSE)-AH10","v":2410},{"$f":"VLOOKUP(AA10,'FY 2024 TABLE 15'!$A$11:$M$146,12,FALSE)-AI10","v":1434904.3307229597},{"$f":"VLOOKUP(AA10,'FY 2024 TABLE 15'!$A$11:$M$146,13,FALSE)-AJ10","v":4595}]
[null,null,null,null,null,null,null,null,null,null,null,null,null,null,null,null,null,null,null,null,null,null,null,null,null,null,10,"Bedford County/City 6",43384469.757217973,4488,7960882.1000000006,824,37394612.029999994,3869,101757122.10721797,10527,{"$f":"VLOOKUP(AA11,'FY 2024 TABLE 15'!$A$11:$M$146,6,FALSE)-AC11","v":18983763.942782037},{"$f":"VLOOKUP(AA11,'FY 2024 TABLE 15'!$A$11:$M$146,7,FALSE)-AD11","v":2469},{"$f":"VLOOKUP(AA11,'FY 2024 TABLE 15'!$A$11:$M$146,10,FALSE)-AE11","v":2549088.0999999987},{"$f":"VLOOKUP(AA11,'FY 2024 TABLE 15'!$A$11:$M$146,11,FALSE)-AF11","v":348},{"$f":"VLOOKUP(AA11,'FY 2024 TABLE 15'!$A$11:$M$146,4,FALSE)-AG11","v":5604.7899999991059},{"$f":"VLOOKUP(AA11,'FY 2024 TABLE 15'!$A$11:$M$146,5,FALSE)-AH11","v":303},{"$f":"VLOOKUP(AA11,'FY 2024 TABLE 15'!$A$11:$M$146,12,FALSE)-AI11","v":23866447.852782041},{"$f":"VLOOKUP(AA11,'FY 2024 TABLE 15'!$A$11:$M$146,13,FALSE)-AJ11","v":3486}]
["1c.  Plus state revenues to divisions participating in regional programs:",null,null,null,null,null,null,null,null,null,null,null,null,null,null,null,null,null,null,null,null,null,null,null,null,null,11,"Bland",4128450.8092662478,5450,583024.53,770,2946824.8000000007,3890,8544175.2392662484,11279,{"$f":"VLOOKUP(AA12,'FY 2024 TABLE 15'!$A$11:$M$146,6,FALSE)-AC12","v":2311740.9507337529},{"$f":"VLOOKUP(AA12,'FY 2024 TABLE 15'!$A$11:$M$146,7,FALSE)-AD12","v":2594},{"$f":"VLOOKUP(AA12,'FY 2024 TABLE 15'!$A$11:$M$146,10,FALSE)-AE12","v":438930.8899999999},{"$f":"VLOOKUP(AA12,'FY 2024 TABLE 15'!$A$11:$M$146,11,FALSE)-AF12","v":506},{"$f":"VLOOKUP(AA12,'FY 2024 TABLE 15'!$A$11:$M$146,4,FALSE)-AG12","v":893174.44999999925},{"$f":"VLOOKUP(AA12,'FY 2024 TABLE 15'!$A$11:$M$146,5,FALSE)-AH12","v":906},{"$f":"VLOOKUP(AA12,'FY 2024 TABLE 15'!$A$11:$M$146,12,FALSE)-AI12","v":3626125.8307337519},{"$f":"VLOOKUP(AA12,'FY 2024 TABLE 15'!$A$11:$M$146,13,FALSE)-AJ12","v":3921}]
[null,null,null,null,null,null,null,null,null,null,null,null,null,null,null,null,null,null,null,null,null,null,null,null,null,null,12,"Botetourt",19203349.993347172,4147,2254484.58,487,25585640.990000002,5525,52605487.283347175,11359,{"$f":"VLOOKUP(AA13,'FY 2024 TABLE 15'!$A$11:$M$146,6,FALSE)-AC13","v":7968034.8966528252},{"$f":"VLOOKUP(AA13,'FY 2024 TABLE 15'!$A$11:$M$146,7,FALSE)-AD13","v":1966},{"$f":"VLOOKUP(AA13,'FY 2024 TABLE 15'!$A$11:$M$146,10,FALSE)-AE13","v":3659458.9399999995},{"$f":"VLOOKUP(AA13,'FY 2024 TABLE 15'!$A$11:$M$146,11,FALSE)-AF13","v":844},{"$f":"VLOOKUP(AA13,'FY 2024 TABLE 15'!$A$11:$M$146,4,FALSE)-AG13","v":5712160.5600000098},{"$f":"VLOOKUP(AA13,'FY 2024 TABLE 15'!$A$11:$M$146,5,FALSE)-AH13","v":1517},{"$f":"VLOOKUP(AA13,'FY 2024 TABLE 15'!$A$11:$M$146,12,FALSE)-AI13","v":18295677.756652832},{"$f":"VLOOKUP(AA13,'FY 2024 TABLE 15'!$A$11:$M$146,13,FALSE)-AJ13","v":4593}]
[null,"Alternative Education",null,null,null,{"$f":"VLOOKUP($A$5,'Source Data'!$AI$3:$AK$138,3,FALSE)","v":{"$error":"#N/A"}},null,null,null,null,null,null,null,null,null,null,null,null,null,null,null,null,null,null,null,null,13,"Brunswick",11444215.889506439,6718,3447896.13,2024,5127260.0000000065,3010,22353256.419506446,13123,{"$f":"VLOOKUP(AA14,'FY 2024 TABLE 15'!$A$11:$M$146,6,FALSE)-AC14","v":547772.35049356148},{"$f":"VLOOKUP(AA14,'FY 2024 TABLE 15'!$A$11:$M$146,7,FALSE)-AD14","v":1999},{"$f":"VLOOKUP(AA14,'FY 2024 TABLE 15'!$A$11:$M$146,10,FALSE)-AE14","v":1747343.87},{"$f":"VLOOKUP(AA14,'FY 2024 TABLE 15'!$A$11:$M$146,11,FALSE)-AF14","v":1752},{"$f":"VLOOKUP(AA14,'FY 2024 TABLE 15'!$A$11:$M$146,4,FALSE)-AG14","v":3440204.9799999939},{"$f":"VLOOKUP(AA14,'FY 2024 TABLE 15'!$A$11:$M$146,5,FALSE)-AH14","v":3218},{"$f":"VLOOKUP(AA14,'FY 2024 TABLE 15'!$A$11:$M$146,12,FALSE)-AI14","v":5729929.2204935551},{"$f":"VLOOKUP(AA14,'FY 2024 TABLE 15'!$A$11:$M$146,13,FALSE)-AJ14","v":7290}]
[null,null,null,null,null,null,null,null,null,null,null,null,null,null,null,null,null,null,null,null,null,null,null,null,null,null,14,"Buchanan",16344026.504572613,5622,4048709.93,1393,9234576.9399999995,3176,32815768.034572612,11288,{"$f":"VLOOKUP(AA15,'FY 2024 TABLE 15'!$A$11:$M$146,6,FALSE)-AC15","v":58197.305427387357},{"$f":"VLOOKUP(AA15,'FY 2024 TABLE 15'!$A$11:$M$146,7,FALSE)-AD15","v":1333},{"$f":"VLOOKUP(AA15,'FY 2024 TABLE 15'!$A$11:$M$146,10,FALSE)-AE15","v":4359764.1399999987},{"$f":"VLOOKUP(AA15,'FY 2024 TABLE 15'!$A$11:$M$146,11,FALSE)-AF15","v":2173},{"$f":"VLOOKUP(AA15,'FY 2024 TABLE 15'!$A$11:$M$146,4,FALSE)-AG15","v":5337206.4299999978},{"$f":"VLOOKUP(AA15,'FY 2024 TABLE 15'!$A$11:$M$146,5,FALSE)-AH15","v":3003},{"$f":"VLOOKUP(AA15,'FY 2024 TABLE 15'!$A$11:$M$146,12,FALSE)-AI15","v":9891687.8354273848},{"$f":"VLOOKUP(AA15,'FY 2024 TABLE 15'!$A$11:$M$146,13,FALSE)-AJ15","v":6822}]
{"$rows_left_out":123}
{"sheet":"Fiscal Year 2025 Worksheet","index":2,"n_rows":70,"n_cols":8,"rows_kept":70,"cut":false,"hidden":false,"merged":[[67,0,67,7],[68,0,68,7],[42,0,42,2],[65,0,65,7],[38,0,38,3],[66,0,66,7],[0,0,0,7],[1,0,1,7],[19,0,19,2],[8,0,8,3],[7,0,7,2]]}
["SUPERINTENDENT'S ANNUAL REPORT FOR VIRGINIA"]
["TABLE 15 METHODOLOGY - FISCAL YEAR 2025 Estimate\nNote: As of FY 2012, Table 15 contains Pre-kindergarten (Program 8) expenditures and average daily membership (ADM)."]
[]
["Div Num","Division"]
[{"$f":"'Fiscal Year 2024 Worksheet'!A5","v":0},{"$f":"'Fiscal Year 2024 Worksheet'!B5","v":"<SELECT DIVISION>"}]
[]
[]
["1a.  Expenditures for operations:  (see cell comment)"]
["Click here for Chart of Accounts"]
["1b.  Less tuition from another county or city (revenue 1901010 and 1901020): "]
[]
["1c.  Plus state revenues to divisions participating in regional programs:"]
[]
[null,"Alternative Education"]
[]
{"$rows_left_out":56}
{"sheet":"Fiscal Year 2026 Worksheet","index":3,"n_rows":70,"n_cols":8,"rows_kept":70,"cut":false,"hidden":false,"merged":[[68,0,68,7],[42,0,42,2],[38,0,38,3],[8,0,8,3],[65,0,65,7],[66,0,66,7],[0,0,0,7],[1,0,1,7],[19,0,19,2],[67,0,67,7],[7,0,7,2]]}
["SUPERINTENDENT'S ANNUAL REPORT FOR VIRGINIA"]
["TABLE 15 METHODOLOGY - FISCAL YEAR 2026 Estimate\nNote: As of FY 2012, Table 15 contains Pre-kindergarten (Program 8) expenditures and average daily membership (ADM)."]
[]
["Div Num","Division"]
[{"$f":"'Fiscal Year 2024 Worksheet'!A5","v":0},{"$f":"'Fiscal Year 2024 Worksheet'!B5","v":"<SELECT DIVISION>"}]
[]
[]
["1a.  Expenditures for operations:  (see cell comment)"]
["Click here for Chart of Accounts"]
["1b.  Less tuition from another county or city (revenue 1901010 and 1901020): "]
[]
["1c.  Plus state revenues to divisions participating in regional programs:"]
[]
[null,"Alternative Education"]
[]
{"$rows_left_out":56}
{"sheet":"Division Source","index":4,"n_rows":132,"n_cols":3,"rows_kept":132,"cut":false,"hidden":true,"merged":[]}
["000 - <SELECT DIVISION>",null,"<SELECT DIVISION>"]
["001 - ACCOMACK",1," ACCOMACK"]
["002 - ALBEMARLE",2," ALBEMARLE"]
["003 - ALLEGHANY HIGHLANDS",3," ALLEGHANY HIGHLANDS"]
["004 - AMELIA",4," AMELIA"]
["005 - AMHERST",5," AMHERST"]
["006 - APPOMATTOX",6," APPOMATTOX"]
["007 - ARLINGTON",7," ARLINGTON"]
["008 - AUGUSTA",8," AUGUSTA"]
["009 - BATH",9," BATH"]
["010 - BEDFORD",10," BEDFORD"]
["011 - BLAND",11," BLAND"]
["012 - BOTETOURT",12," BOTETOURT"]
["013 - BRUNSWICK",13," BRUNSWICK"]
["014 - BUCHANAN",14," BUCHANAN"]
{"$rows_left_out":118}
{"sheet":"Source Data","index":5,"n_rows":140,"n_cols":39,"rows_kept":140,"cut":false,"hidden":true,"merged":[[0,25,0,27],[0,29,0,31]]}
["Div","State Rev","S - BOY","S - EOY","S - Capital","Exp Deduct","Total State","Sales Tax","Federal","F - BOY","F - EOY","F - Capital","Total Federal","Local","Local Tuition Deduct","Expenditures","BOD EOY ADM WITH PRE-K",null,"Sales Tax FY 2024","Sales Tax FY 2025","UPDATED-Projections based on GA Conference Caboose Budget - HB30 & Big Bill Budget",null,null,null,null,"DABS Sales Tax fy 2025",null,null,null,"DABS Sales Tax fy 2026",null,null,null,null,"DABS Alt Ed and Govs School","Data from 2023-2024Table 15 source file with queries for Alt Ed & Govs School"]
[1,42481409.729999997,2183938,4518044.38,477545.55,0,{"$f":"SUM(B2+C2-D2-E2-F2)","v":39669757.799999997},6009078.5999999996,12952597.010000002,1630441.26,1322851.07,269574.89,{"$f":"SUM(I2+J2-K2-L2)","v":12990612.310000001},{"$f":"SUM(P2-(G2+H2+M2))","v":19078078.309999995},0,77747527.019999996,{"$f":"VLOOKUP($A2,'FY 2024 TABLE 15'!$A$11:$C$144,3,FALSE)","v":4757.3500000000004},null,{"$f":"VLOOKUP(A2,$Z$3:$AB$138,3,FALSE)","v":6113863.1314905733},{"$f":"VLOOKUP($A2,$AD$3:$AF$138,3,FALSE)","v":6462046.1409108071},null,null,null,null,null,"NUM","DIVISION","SALES TAX",null,"NUM","DIVISION","SALES TAX",null,null,"NUM","DIVISION","ALT ED AMT","GOVS SCHOOL"]
[2,56752909.060000002,0,0,0,0,56752909.060000002,21141568.359999999,14249044.15,358488.07,298147.95,0,{"$f":"SUM(I3+J3-K3-L3)","v":14309384.270000001},203640980.58999997,0,295844842.27999997,{"$f":"VLOOKUP($A3,'FY 2024 TABLE 15'!$A$11:$C$144,3,FALSE)","v":13840.910000000002},null,{"$f":"VLOOKUP(A3,$Z$3:$AB$138,3,FALSE)","v":21562131.382045627},21728058.064057495,null,null,null,null,null,1,"ACCOMACK",6113863.1314905733,null,1,"ACCOMACK",6462046.1409108071,null,null,1,"ACCOMACK",68145,0]
[3,26326523.690000001,0,0,0,0,{"$f":"SUM(B4+C4-D4-E4-F4)","v":26326523.690000001},3778505,5829712.5700000003,0,0,275141.14,5554571.4300000006,11666762.339999996,0,47326362.460000001,{"$f":"VLOOKUP($A4,'FY 2024 TABLE 15'!$A$11:$C$144,3,FALSE)","v":2793.8900000000003},null,3755505.0115793329,4020779.098213979,null,null,null,null,null,2,"ALBEMARLE",21562131.382045627,null,2,"ALBEMARLE",21728058.064057495,null,null,2,"ALBEMARLE",0,0]
[4,12712538.600000001,450753,534210.69999999995,5883,0,12623197.900000002,2487402.84,3657993.9700000007,0,0,885218.71,2772775.2600000007,6470975.8299999945,0,24354351.829999998,{"$f":"VLOOKUP($A5,'FY 2024 TABLE 15'!$A$11:$C$144,3,FALSE)","v":1585.71},null,2440163.3308255509,2588613.7503493107,null,null,null,null,null,3,"ALLEGHANY",3755505.0115793329,null,3,"ALLEGHANY",4020779.098213979,null,null,3,"ALLEGHANY",24931,31932]
[5,34479196.539999999,0,0,0,0,34479196.539999999,5881097.4199999999,11452092.23,0,0,4592077.1900000004,6860015.04,15410127.450000003,43935,62630436.450000003,{"$f":"VLOOKUP($A6,'FY 2024 TABLE 15'!$A$11:$C$144,3,FALSE)","v":3923.25},null,5775878.4442919744,5961960.345241772,null,null,null,null,null,4,"AMELIA",2440163.3308255509,null,4,"AMELIA",2588613.7503493107,null,null,4,"AMELIA",65615,98093]
[6,20339242.739999998,0,0,3183015.8,0,17156226.939999998,3207177.76,4032353.34,0,0,554500,3477853.34,8404386.5100000016,28779.670000000002,32245644.549999997,{"$f":"VLOOKUP($A7,'FY 2024 TABLE 15'!$A$11:$C$144,3,FALSE)","v":2344.19},null,3320645.7325085243,3455950.0522127929,null,null,null,null,null,5,"AMHERST",5775878.4442919744,null,5,"AMHERST",5961960.345241772,null,null,5,"AMHERST",51576,48102]
[7,71667801.129999995,0,0,0,0,71667801.129999995,36550281.630000003,28520489.110000003,0,0,4321580.3,24198908.810000002,598006075.4000001,176457.60000000001,730423066.97000003,{"$f":"VLOOKUP($A8,'FY 2024 TABLE 15'!$A$11:$C$144,3,FALSE)","v":27856.74},null,38312824.701104835,41119777.801473722,null,null,null,null,null,6,"APPOMATTOX",3320645.7325085243,null,6,"APPOMATTOX",3455950.0522127929,null,null,6,"APPOMATTOX",33765,32474]
[8,71500683.909999996,0,0,0,839123,70661560.909999996,14586709.92,15792415.310000001,0,0,2075688,13716727.310000001,48318332.650000021,1024298.2,147283330.79000002,{"$f":"VLOOKUP($A9,'FY 2024 TABLE 15'!$A$11:$C$144,3,FALSE)","v":10048.799999999999},null,14499973.634561533,14539324.751315124,null,null,null,null,null,7,"ARLINGTON",38312824.701104835,null,7,"ARLINGTON",41119777.801473722,null,null,7,"ARLINGTON",0,130968]
[9,1898367.78,0,0,0,0,1898367.78,652151.69999999995,1090342.1200000001,0,0,0,1090342.1200000001,8805602.5500000007,0,12446464.15,{"$f":"VLOOKUP($A10,'FY 2024 TABLE 15'!$A$11:$C$144,3,FALSE)","v":508.72},null,642601.45941899158,674222.81380378781,null,null,null,null,null,8,"AUGUSTA",14499973.634561533,null,8,"AUGUSTA",14539324.751315124,null,null,8,"AUGUSTA",174224,529658]
[10,64774391.960000008,0,0,0,0,64774391.960000008,15345149.24,11596243.279999999,0,0,1086273.0799999998,{"$f":"SUM(I11+J11-K11-L11)","v":10509970.199999999},34994058.560000002,108322.49,125623569.96000001,{"$f":"VLOOKUP($A11,'FY 2024 TABLE 15'!$A$11:$C$144,3,FALSE)","v":8964.5},null,{"$f":"VLOOKUP(A11,$Z$3:$AB$138,3,FALSE)+VLOOKUP(140,$Z$3:$AB$138,3,FALSE)","v":15053235.192587264},{"$f":"VLOOKUP($A11,$AD$3:$AF$138,3,FALSE)+VLOOKUP(140,$AD$3:$AF$138,3,FALSE)","v":15951397.366318092},null,null,null,null,null,9,"BATH",642601.45941899158,null,9,"BATH",674222.81380378781,null,null,9,"BATH",5022,1384]
[11,6781106.9000000004,2948522.56,3084358.7,0,0,6645270.7600000007,868154.64,1021955.4199999999,0,0,0,1021955.4199999999,3634920.25,101704,12170301.07,{"$f":"VLOOKUP($A12,'FY 2024 TABLE 15'!$A$11:$C$144,3,FALSE)","v":800.66},null,{"$f":"VLOOKUP(A12,$Z$3:$AB$138,3,FALSE)","v":894475.39828673704},{"$f":"VLOOKUP($A12,$AD$3:$AF$138,3,FALSE)","v":914219.34520745382},null,null,null,null,null,10,"BEDFORD",15053235.192587264,null,10,"BEDFORD",15951397.366318092,null,null,10,"BEDFORD",80544,209089]
[12,28116738.709999997,0,0,0,0,28116738.709999997,6518035.0800000001,5944641.2399999993,0,0,30697.72,5913943.5199999996,30352447.730000004,0,70901165.040000007,{"$f":"VLOOKUP($A13,'FY 2024 TABLE 15'!$A$11:$C$144,3,FALSE)","v":4444.62},null,{"$f":"VLOOKUP(A13,$Z$3:$AB$138,3,FALSE)","v":6413097.9819402881},6387256.5241478039,null,null,null,null,null,11,"BLAND",894475.39828673704,null,11,"BLAND",914219.34520745382,null,null,11,"BLAND",29290,14920]
[13,12961800.01,0,0,190549.77,471884,12299366.24,2328492.42,7444326.4199999999,0,0,2249086.42,5195240,8260086.9800000004,0,28083185.640000001,{"$f":"VLOOKUP($A14,'FY 2024 TABLE 15'!$A$11:$C$144,3,FALSE)","v":1375.7299999999998},null,2310997.2083292715,2317361.8567163302,null,null,null,null,null,12,"BOTETOURT",6413097.9819402881,null,12,"BOTETOURT",6387256.5241478039,null,null,12,"BOTETOURT",22716,57238]
[14,25876305.270000003,467982.41000000003,490332.26,4864009.51,0,20989945.910000004,3324974.62,8685503.0699999984,0,0,277029,8408474.0699999984,9984061.2699999958,0,42707455.869999997,{"$f":"VLOOKUP($A15,'FY 2024 TABLE 15'!$A$11:$C$144,3,FALSE)","v":2358.23},null,3290506.9705927256,3253906.4606590085,null,null,null,null,null,13,"BRUNSWICK",2310997.2083292715,null,13,"BRUNSWICK",2317361.8567163302,null,null,13,"BRUNSWICK",90728,45899]
{"$rows_left_out":125}